Instalando Compiz Fusion no Debian/Ubuntu

Um método simples de instalação do Compiz-Fusion no Debian e Ubuntu(s) sem necessidade de adição de repositórios extras, utilizando-se de um script e instruções disponibilizadas em www.opencompositing.org.

[ Hits: 98.705 ]

Por: Ieso Nagata em 17/07/2007


Introdução



O projeto Beryl foi descontinuado e para que todo o trabalho de desenvolvimento não fosse desperdiçado, houve uma fusão com o Compiz, dando origem ao Compiz-Fusion.

Em www.opencompositing.org/ se encontra o fórum de discussões e outras informações.

Abaixo segue os passos para instalação do mesmo, a qual realizei num Debian Lenny amd64×2 4800 (939) NVidia GeForce FX5200.

Instalando o driver NVIDIA

$ sudo aptitude install linux-headers-`uname -r` build-essential

(pacotes necessários para compilação do driver)

Baixe o driver em www.nvidia.com/object/unix.html e saímos da interface gráfica pressionando "Ctrl+Alt+F1" e logamos como root ou usuário com tais permissões.

Já logado deve-se parar o X:

# /etc/init.d/kdm stop (ou gdm, ou xdm)

# sh /local/download/NVIDIA-Linux-xxx-yyy-pkg2.run

Quando questionado por procurar um kernel no ftp.nvidia, opte por não e ao final permita que o instalador modifique o /etc/X11/xorg.conf automaticamente.

Reiniciando o X:

# /etc/init.d/kdm start

O logo NVidia será exibido, driver instalado!

    Próxima página

Páginas do artigo
   1. Introdução
   2. Configurações adicionais NVIDIA
   3. Instalação do Compiz + Emerald
   4. Créditos e notas finais
Outros artigos deste autor
Nenhum artigo encontrado.
Leitura recomendada

jKiwi: Simulando pintura de cabelo e novo visual com Software Livre

Experimentos com GNOME3 em instalações contendo outros ambientes gráficos

Experimentando o XGL/Compiz no Mandriva 2007

Salvando arquivos do Inkscape para o CorelDraw

Mencoder - Convertentdo vídeos de webcam para divx

  
Comentários
[1] Comentário enviado por slipkd em 17/07/2007 - 10:18h

Dá um pouco "mais de trabalho agora", por mim tudo bem :-D

Você pode comentar o que mudou ? melhorou ? faltou um screenshot né

[] 's

[2] Comentário enviado por Ieso Nagata em 18/07/2007 - 03:56h

slipk-down
não posso citar melhorias ou mudanças, pois nunca utilizei-o até então, sendo que essa instalação foi experimental, para encontrar uma maneira de guiar um amigo que me pediu para auxiliá-lo na implementação do mesmo em seu PC.
E não o utilizo, uma boa razão para testar a função -uninstall do script :P

em relação a screenshots, há milhares deles espalhados pela net, diferenciado apenas pelos temas, plano de fundo, etc, ao gosto do usuário.
ex.: http://compiz.org/Home/Screenshots

gravei um vídeo local com taxa de vídeo 10FPS, somando a conversão do GoogleVídeo, houve grande perda de qualidade, em todo caso:
http://video.google.com/videoplay?docid=-5683002899203178784&hl=en

[3] Comentário enviado por slipkd em 18/07/2007 - 07:49h

Tudo bem então amigo !!

abraços

[4] Comentário enviado por founddeath em 18/07/2007 - 10:07h

Well... ainda não apliquei este tutorial, mas pelo que vi no arquivo que editou do compiz... essa configuração é para o KDE. certo?

[5] Comentário enviado por dailson em 18/07/2007 - 17:32h

Amigo.

Uso o Ubuntu e o Kubuntu, mas o resultado do script é desastroso....
Depois de varias tentativas, descobri que o shell nao está reconhecendo a declaração da constante function ... tanto com o interpretador como sh ou como bash.
Tive que retirar todas as funcoes e substituir por:
nome_funcao () {
blá
blá
blá
}

Só então depois disto que o script rodou.

Um abraço

Dailson

[6] Comentário enviado por Ieso Nagata em 18/07/2007 - 18:29h

founddeath
sim, as informações acima são para o KDE

dailson
KDE ou GNOME? (k)Ubuntu Feisty 7.04?
e o gitweb foi instalado corretamente, pois o "clone" nada mais é que o git-clone.


acabei de desinstala-lo, substituí a FX5200(128M) por 6600(256M), purgei todo KDE e instalei Gnome, "re-clonei" e reinstalei, muitos pluigns não estão presentes no Gnome, vou pesquisar sobre...

[7] Comentário enviado por gearfried91 em 19/07/2007 - 03:47h

O Cubo eh lerdo X_X
e meu pc ta mais lerdo
mas
otimo artigo Vlw =D

[8] Comentário enviado por dailson em 19/07/2007 - 13:35h

Oi IEso

TEnho os dois instalados. KDE e GNOME na mesma máquina...
O Git estava instalado... eu não sei o que houve, mas agora está funcionando....
A bronca é... CADÊ O GERENCIADOR DE EFEITOS???????????????????

[9] Comentário enviado por Ieso Nagata em 19/07/2007 - 17:46h

gearfried91
confira as configurações da placa de vídeo
(por email) se as barras continuam desaparecendo, entende-se que você já tentou uma instalação anterior, então desative qualquer instância, apague o arquvo oculto de configuração em sua home (.compiz*) e reinicie-o

dailson
as configurações do compiz são atrvés do CompizConfig Settings Manager, caso não esteja presente no menu, rode o "kappfinder" >> buscar >> selecione tudo >> aplicar, ou então digite "ccsm"num terminal!


###### UPDATED #######
versão mais recente do script:

http://iesonagata.googlepages.com/makefusion7-47.gz

aparentemente possui outros plugins, caso já tenha instalado o anterior, basta reverter o processo com "$sh makefusion7.41 uninstall" , corra novamente as etapas "packages" e "clone" para checar os pacotes adicionados ( somente o que não estiver presente em seu PC será baixado, aproveitando o existente até então)

24/07
em alguns casos, o CCSM não inicia por falta do python-gtk2 (pygtk), instále-o manualmente!

[10] Comentário enviado por f_Candido em 20/07/2007 - 21:12h

Bem interessante...

[11] Comentário enviado por avena em 10/08/2007 - 22:39h

estou usando debian etch e esta dando um erro......veja a parte do clone vai a do install nada....

$ sh makefusion7-47 clone

Updating compiz

Updating bcop

Updating libcompizconfig

Updating compizconfig-python

Updating ccsm

Cloning compiz-scripts
remote: Generating pack...
remote: Done counting 98 objects.
remote: Deltifying 98 objects.
remote: 100% (98/98) done
Indexing 98 objects.
remote: Total 98 (delta 26), reused 0 (delta 0)
100% (98/98) done
Resolving 26 deltas.
100% (26/26) done

Updating emerald

Updating emerald-themes

Updating compizconfig-backend-gconf

Updating plugins-main
remote: Generating pack...
remote: Done counting 13 objects.
remote: Result has 7 objects.
remote: Deltifying 7 objects.
remote: 100% (7/7) done
Unpacking 7 objects
remote: Total 7 (delta 5), reused 0 (delta 0)

* refs/heads/origin: fast forward to branch 'master' of git://annongit.opencompositing.org/fusion/plugins-main
old..new: 1522934..9ec9cea

Updating plugins-extra
remote: Generating pack...
remote: Done counting 7 objects.
remote: Result has 4 objects.
remote: Deltifying 4 objects.
remote: 100% (4/4) done
Unpacking 4 objects
remote: Total 4 (delta 2), reused 0 (delta 0)

* refs/heads/origin: fast forward to branch 'master' of git://annongit.opencompositing.org/fusion/plugins-extra
old..new: 23fd7fa..a396451

Updating plugins-unsupported

Updating zoom
remote: Generating pack...
remote: Done counting 7 objects.
remote: Result has 4 objects.
remote: Deltifying 4 objects.
remote: 100% (4/4) done
remote: Total 4 (delta 2), reused 0 (delta 0)
Unpacking 4 objects
100% (4/4) done
* refs/heads/origin: fast forward to branch 'master' of git://annongit.opencompositing.org/users/kristian/zoom
old..new: a54cdef..91032f5

Updating wallpaper

Updating 3d

Updating screensaver

Updating gears

Updating atlantis

Updating widget



$ sh makefusion7-47 install
Password:
casa is not in the sudoers file. This incident will be reported.

Configuring compiz...

Executing autogen.sh --prefix=/usr/local --enable-gtk --disable-kde --enable-librsvg --disable-fuse in compiz...
autoreconf: Entering directory `.'
autoreconf: configure.ac: not using Gettext
autoreconf: running: aclocal
/usr/share/aclocal/gtk--.m4:10: warning: underquoted definition of AM_PATH_GTKMM
/usr/share/aclocal/gtk--.m4:10: run info '(automake)Extending aclocal'
/usr/share/aclocal/gtk--.m4:10: or see http://sources.redhat.com/automake/automake.html#Extending-aclocal
autoreconf: configure.ac: tracing
autoreconf: running: libtoolize --copy
libtoolize: `config.guess' exists: use `--force' to overwrite
libtoolize: `config.sub' exists: use `--force' to overwrite
libtoolize: `ltmain.sh' exists: use `--force' to overwrite
/usr/share/aclocal/gtk--.m4:10: warning: underquoted definition of AM_PATH_GTKMM
/usr/share/aclocal/gtk--.m4:10: run info '(automake)Extending aclocal'
/usr/share/aclocal/gtk--.m4:10: or see http://sources.redhat.com/automake/automake.html#Extending-aclocal
autoreconf: running: /usr/bin/autoconf
configure.ac:23: error: possibly undefined macro: AC_PROG_INTLTOOL
If this token and others are legitimate, please use m4_pattern_allow.
See the Autoconf documentation.
autoreconf: /usr/bin/autoconf failed with exit status: 1

Installing compiz...

Executing make
make: *** Nenhum alvo indicado e nenhum arquivo make encontrado. Pare.

Executing sudo make install
casa is not in the sudoers file. This incident will be reported.

Configuring bcop...

Executing autogen.sh --prefix=/usr/local in bcop...
autoreconf: Entering directory `.'
autoreconf: configure.ac: not using Gettext
autoreconf: running: aclocal
/usr/share/aclocal/gtk--.m4:10: warning: underquoted definition of AM_PATH_GTKMM
/usr/share/aclocal/gtk--.m4:10: run info '(automake)Extending aclocal'
/usr/share/aclocal/gtk--.m4:10: or see http://sources.redhat.com/automake/automake.html#Extending-aclocal
autoreconf: configure.ac: tracing
autoreconf: configure.ac: not using Libtool
autoreconf: running: /usr/bin/autoconf
autoreconf: running: /usr/bin/autoheader
autoreconf: running: automake --add-missing --copy --no-force
autoreconf: Leaving directory `.'

Installing bcop...

Executing make

Executing sudo make install
casa is not in the sudoers file. This incident will be reported.

Configuring libcompizconfig...

Executing autogen.sh --prefix=/usr/local in libcompizconfig...
autoreconf: Entering directory `.'
autoreconf: configure.ac: not using Gettext
autoreconf: running: aclocal
/usr/share/aclocal/gtk--.m4:10: warning: underquoted definition of AM_PATH_GTKMM
/usr/share/aclocal/gtk--.m4:10: run info '(automake)Extending aclocal'
/usr/share/aclocal/gtk--.m4:10: or see http://sources.redhat.com/automake/automake.html#Extending-aclocal
autoreconf: configure.ac: tracing
autoreconf: running: libtoolize --copy
libtoolize: `config.guess' exists: use `--force' to overwrite
libtoolize: `config.sub' exists: use `--force' to overwrite
libtoolize: `ltmain.sh' exists: use `--force' to overwrite
/usr/share/aclocal/gtk--.m4:10: warning: underquoted definition of AM_PATH_GTKMM
/usr/share/aclocal/gtk--.m4:10: run info '(automake)Extending aclocal'
/usr/share/aclocal/gtk--.m4:10: or see http://sources.redhat.com/automake/automake.html#Extending-aclocal
autoreconf: running: /usr/bin/autoconf
autoreconf: running: /usr/bin/autoheader
autoreconf: running: automake --add-missing --copy --no-force
autoreconf: Leaving directory `.'
./autogen.sh: line 11: intltoolize: command not found

Installing libcompizconfig...

Executing make
make: *** Nenhum alvo indicado e nenhum arquivo make encontrado. Pare.

Executing sudo make install
casa is not in the sudoers file. This incident will be reported.

Configuring compizconfig-python...

Executing autogen.sh --prefix=/usr/local in compizconfig-python...
autoreconf: Entering directory `.'
autoreconf: configure.ac: not using Gettext
autoreconf: running: aclocal
/usr/share/aclocal/gtk--.m4:10: warning: underquoted definition of AM_PATH_GTKMM
/usr/share/aclocal/gtk--.m4:10: run info '(automake)Extending aclocal'
/usr/share/aclocal/gtk--.m4:10: or see http://sources.redhat.com/automake/automake.html#Extending-aclocal
autoreconf: configure.ac: tracing
autoreconf: running: libtoolize --copy
libtoolize: `config.guess' exists: use `--force' to overwrite
libtoolize: `config.sub' exists: use `--force' to overwrite
libtoolize: `ltmain.sh' exists: use `--force' to overwrite
/usr/share/aclocal/gtk--.m4:10: warning: underquoted definition of AM_PATH_GTKMM
/usr/share/aclocal/gtk--.m4:10: run info '(automake)Extending aclocal'
/usr/share/aclocal/gtk--.m4:10: or see http://sources.redhat.com/automake/automake.html#Extending-aclocal
autoreconf: running: /usr/bin/autoconf
autoreconf: running: /usr/bin/autoheader
autoreconf: running: automake --add-missing --copy --no-force
autoreconf: Leaving directory `.'
configure: error: Package requirements (libcompizconfig >= 0.0.1 glib-2.0 >= 2.6 ) were not met:

No package 'libcompizconfig' found

Consider adjusting the PKG_CONFIG_PATH environment variable if you
installed software in a non-standard prefix.

Alternatively, you may set the environment variables CCS_CFLAGS
and CCS_LIBS to avoid the need to call pkg-config.
See the pkg-config man page for more details.


Installing compizconfig-python...

Executing make
make: *** Nenhum alvo indicado e nenhum arquivo make encontrado. Pare.

Executing sudo make install
casa is not in the sudoers file. This incident will be reported.

Installing ccsm...

Executing make

Executing make install
error: could not delete '/usr/local/lib/python2.4/site-packages/ccm/Constants.py': Permission denied
make: ** [install] Erro 1

Installing compiz-scripts...

Executing make
make: *** Nenhum alvo indicado e nenhum arquivo make encontrado. Pare.

Executing make install
make: *** Sem regra para processar o alvo `install'. Pare.

Configuring emerald...

Executing autogen.sh --prefix=/usr/local in emerald...
autoreconf: Entering directory `.'
autoreconf: configure.ac: not using Gettext
autoreconf: running: aclocal
/usr/share/aclocal/gtk--.m4:10: warning: underquoted definition of AM_PATH_GTKMM
/usr/share/aclocal/gtk--.m4:10: run info '(automake)Extending aclocal'
/usr/share/aclocal/gtk--.m4:10: or see http://sources.redhat.com/automake/automake.html#Extending-aclocal
autoreconf: configure.ac: tracing
autoreconf: running: libtoolize --copy
libtoolize: `config.guess' exists: use `--force' to overwrite
libtoolize: `config.sub' exists: use `--force' to overwrite
libtoolize: `ltmain.sh' exists: use `--force' to overwrite
/usr/share/aclocal/gtk--.m4:10: warning: underquoted definition of AM_PATH_GTKMM
/usr/share/aclocal/gtk--.m4:10: run info '(automake)Extending aclocal'
/usr/share/aclocal/gtk--.m4:10: or see http://sources.redhat.com/automake/automake.html#Extending-aclocal
autoreconf: running: /usr/bin/autoconf
autoreconf: running: /usr/bin/autoheader
autoreconf: running: automake --add-missing --copy --no-force
autoreconf: Leaving directory `.'
./autogen.sh: line 11: intltoolize: command not found

Installing emerald...

Executing make
make: *** Nenhum alvo indicado e nenhum arquivo make encontrado. Pare.

Executing sudo make install
casa is not in the sudoers file. This incident will be reported.

Configuring emerald-themes...

Executing autogen.sh --prefix=/usr/local in emerald-themes...
autoreconf: Entering directory `.'
autoreconf: configure.ac: not using Gettext
autoreconf: running: aclocal
/usr/share/aclocal/gtk--.m4:10: warning: underquoted definition of AM_PATH_GTKMM
/usr/share/aclocal/gtk--.m4:10: run info '(automake)Extending aclocal'
/usr/share/aclocal/gtk--.m4:10: or see http://sources.redhat.com/automake/automake.html#Extending-aclocal
autoreconf: configure.ac: tracing
autoreconf: configure.ac: not using Libtool
autoreconf: running: /usr/bin/autoconf
autoreconf: running: /usr/bin/autoheader
autoreconf: running: automake --add-missing --copy --no-force
autoreconf: Leaving directory `.'

Installing emerald-themes...

Executing make

Executing sudo make install
casa is not in the sudoers file. This incident will be reported.

Configuring compizconfig-backend-gconf...

Executing autogen.sh --prefix=/usr/local in compizconfig-backend-gconf...
autoreconf: Entering directory `.'
autoreconf: configure.ac: not using Gettext
autoreconf: running: aclocal
/usr/share/aclocal/gtk--.m4:10: warning: underquoted definition of AM_PATH_GTKMM
/usr/share/aclocal/gtk--.m4:10: run info '(automake)Extending aclocal'
/usr/share/aclocal/gtk--.m4:10: or see http://sources.redhat.com/automake/automake.html#Extending-aclocal
autoreconf: configure.ac: tracing
autoreconf: running: libtoolize --copy
libtoolize: `config.guess' exists: use `--force' to overwrite
libtoolize: `config.sub' exists: use `--force' to overwrite
libtoolize: `ltmain.sh' exists: use `--force' to overwrite
/usr/share/aclocal/gtk--.m4:10: warning: underquoted definition of AM_PATH_GTKMM
/usr/share/aclocal/gtk--.m4:10: run info '(automake)Extending aclocal'
/usr/share/aclocal/gtk--.m4:10: or see http://sources.redhat.com/automake/automake.html#Extending-aclocal
autoreconf: running: /usr/bin/autoconf
autoreconf: configure.ac: not using Autoheader
autoreconf: running: automake --add-missing --copy --no-force
autoreconf: Leaving directory `.'
./autogen.sh: line 11: intltoolize: command not found

Installing compizconfig-backend-gconf...

Executing make
make: *** Nenhum alvo indicado e nenhum arquivo make encontrado. Pare.

Executing sudo make install
casa is not in the sudoers file. This incident will be reported.

Configuring plugins-main...

Executing autogen.sh --prefix=/usr/local in plugins-main...
autoreconf: Entering directory `.'
autoreconf: configure.ac: not using Gettext
autoreconf: running: aclocal
/usr/share/aclocal/gtk--.m4:10: warning: underquoted definition of AM_PATH_GTKMM
/usr/share/aclocal/gtk--.m4:10: run info '(automake)Extending aclocal'
/usr/share/aclocal/gtk--.m4:10: or see http://sources.redhat.com/automake/automake.html#Extending-aclocal
autoreconf: configure.ac: tracing
autoreconf: running: libtoolize --copy
libtoolize: `config.guess' exists: use `--force' to overwrite
libtoolize: `config.sub' exists: use `--force' to overwrite
libtoolize: `ltmain.sh' exists: use `--force' to overwrite
/usr/share/aclocal/gtk--.m4:10: warning: underquoted definition of AM_PATH_GTKMM
/usr/share/aclocal/gtk--.m4:10: run info '(automake)Extending aclocal'
/usr/share/aclocal/gtk--.m4:10: or see http://sources.redhat.com/automake/automake.html#Extending-aclocal
autoreconf: running: /usr/bin/autoconf
autoreconf: running: /usr/bin/autoheader
autoreconf: running: automake --add-missing --copy --no-force
metadata/Makefile.am:31: patsubst %.xml.in,compiz-%.schemas,$(xml_in_files: non-POSIX variable name
metadata/Makefile.am:31: (probably a GNU make extension)
metadata/Makefile.am:34: `%'-style pattern rules are a GNU make extension
metadata/Makefile.am:35: subst compiz-,,$*: non-POSIX variable name
metadata/Makefile.am:35: (probably a GNU make extension)
src/colorfilter/Makefile.am:28: `%'-style pattern rules are a GNU make extension
src/colorfilter/Makefile.am:31: `%'-style pattern rules are a GNU make extension
src/expo/Makefile.am:23: `%'-style pattern rules are a GNU make extension
src/expo/Makefile.am:26: `%'-style pattern rules are a GNU make extension
src/ezoom/Makefile.am:23: `%'-style pattern rules are a GNU make extension
src/ezoom/Makefile.am:26: `%'-style pattern rules are a GNU make extension
src/jpeg/Makefile.am:26: `%'-style pattern rules are a GNU make extension
src/jpeg/Makefile.am:29: `%'-style pattern rules are a GNU make extension
src/neg/Makefile.am:23: `%'-style pattern rules are a GNU make extension
src/neg/Makefile.am:26: `%'-style pattern rules are a GNU make extension
src/opacify/Makefile.am:23: `%'-style pattern rules are a GNU make extension
src/opacify/Makefile.am:26: `%'-style pattern rules are a GNU make extension
src/put/Makefile.am:23: `%'-style pattern rules are a GNU make extension
src/put/Makefile.am:26: `%'-style pattern rules are a GNU make extension
src/resizeinfo/Makefile.am:27: `%'-style pattern rules are a GNU make extension
src/resizeinfo/Makefile.am:30: `%'-style pattern rules are a GNU make extension
src/ring/Makefile.am:23: `%'-style pattern rules are a GNU make extension
src/ring/Makefile.am:26: `%'-style pattern rules are a GNU make extension
src/scaleaddon/Makefile.am:27: `%'-style pattern rules are a GNU make extension
src/scaleaddon/Makefile.am:30: `%'-style pattern rules are a GNU make extension
src/shift/Makefile.am:23: `%'-style pattern rules are a GNU make extension
src/shift/Makefile.am:26: `%'-style pattern rules are a GNU make extension
src/snap/Makefile.am:23: `%'-style pattern rules are a GNU make extension
src/snap/Makefile.am:26: `%'-style pattern rules are a GNU make extension
src/text/Makefile.am:27: `%'-style pattern rules are a GNU make extension
src/text/Makefile.am:30: `%'-style pattern rules are a GNU make extension
src/thumbnail/Makefile.am:23: `%'-style pattern rules are a GNU make extension
src/thumbnail/Makefile.am:26: `%'-style pattern rules are a GNU make extension
src/vpswitch/Makefile.am:23: `%'-style pattern rules are a GNU make extension
src/vpswitch/Makefile.am:26: `%'-style pattern rules are a GNU make extension
src/wall/Makefile.am:27: `%'-style pattern rules are a GNU make extension
src/wall/Makefile.am:30: `%'-style pattern rules are a GNU make extension
src/winrules/Makefile.am:23: `%'-style pattern rules are a GNU make extension
src/winrules/Makefile.am:26: `%'-style pattern rules are a GNU make extension
src/workarounds/Makefile.am:24: `%'-style pattern rules are a GNU make extension
src/workarounds/Makefile.am:27: `%'-style pattern rules are a GNU make extension
autoreconf: Leaving directory `.'
./autogen.sh: line 11: intltoolize: command not found

Installing plugins-main...

Executing make
make: *** Nenhum alvo indicado e nenhum arquivo make encontrado. Pare.

Executing sudo make install
casa is not in the sudoers file. This incident will be reported.

Configuring plugins-extra...

Executing autogen.sh --prefix=/usr/local in plugins-extra...
autoreconf: Entering directory `.'
autoreconf: configure.ac: not using Gettext
autoreconf: running: aclocal
/usr/share/aclocal/gtk--.m4:10: warning: underquoted definition of AM_PATH_GTKMM
/usr/share/aclocal/gtk--.m4:10: run info '(automake)Extending aclocal'
/usr/share/aclocal/gtk--.m4:10: or see http://sources.redhat.com/automake/automake.html#Extending-aclocal
autoreconf: configure.ac: tracing
autoreconf: running: libtoolize --copy
libtoolize: `config.guess' exists: use `--force' to overwrite
libtoolize: `config.sub' exists: use `--force' to overwrite
libtoolize: `ltmain.sh' exists: use `--force' to overwrite
/usr/share/aclocal/gtk--.m4:10: warning: underquoted definition of AM_PATH_GTKMM
/usr/share/aclocal/gtk--.m4:10: run info '(automake)Extending aclocal'
/usr/share/aclocal/gtk--.m4:10: or see http://sources.redhat.com/automake/automake.html#Extending-aclocal
autoreconf: running: /usr/bin/autoconf
autoreconf: running: /usr/bin/autoheader
autoreconf: running: automake --add-missing --copy --no-force
metadata/Makefile.am:28: patsubst %.xml.in,compiz-%.schemas,$(xml_in_files: non-POSIX variable name
metadata/Makefile.am:28: (probably a GNU make extension)
metadata/Makefile.am:31: `%'-style pattern rules are a GNU make extension
metadata/Makefile.am:32: subst compiz-,,$*: non-POSIX variable name
metadata/Makefile.am:32: (probably a GNU make extension)
src/addhelper/Makefile.am:23: `%'-style pattern rules are a GNU make extension
src/addhelper/Makefile.am:26: `%'-style pattern rules are a GNU make extension
src/bench/Makefile.am:23: `%'-style pattern rules are a GNU make extension
src/bench/Makefile.am:26: `%'-style pattern rules are a GNU make extension
src/crashhandler/Makefile.am:23: `%'-style pattern rules are a GNU make extension
src/crashhandler/Makefile.am:26: `%'-style pattern rules are a GNU make extension
src/cubecaps/Makefile.am:27: `%'-style pattern rules are a GNU make extension
src/cubecaps/Makefile.am:30: `%'-style pattern rules are a GNU make extension
src/cubereflex/Makefile.am:27: `%'-style pattern rules are a GNU make extension
src/cubereflex/Makefile.am:30: `%'-style pattern rules are a GNU make extension
src/extrawm/Makefile.am:23: `%'-style pattern rules are a GNU make extension
src/extrawm/Makefile.am:26: `%'-style pattern rules are a GNU make extension
src/fadedesktop/Makefile.am:23: `%'-style pattern rules are a GNU make extension
src/fadedesktop/Makefile.am:26: `%'-style pattern rules are a GNU make extension
src/firepaint/Makefile.am:23: `%'-style pattern rules are a GNU make extension
src/firepaint/Makefile.am:26: `%'-style pattern rules are a GNU make extension
src/gears/Makefile.am:23: `%'-style pattern rules are a GNU make extension
src/gears/Makefile.am:26: `%'-style pattern rules are a GNU make extension
src/goto-viewport/Makefile.am:23: `%'-style pattern rules are a GNU make extension
src/goto-viewport/Makefile.am:26: `%'-style pattern rules are a GNU make extension
src/group/Makefile.am:35: `%'-style pattern rules are a GNU make extension
src/group/Makefile.am:38: `%'-style pattern rules are a GNU make extension
src/mblur/Makefile.am:23: `%'-style pattern rules are a GNU make extension
src/mblur/Makefile.am:26: `%'-style pattern rules are a GNU make extension
src/reflex/Makefile.am:23: `%'-style pattern rules are a GNU make extension
src/reflex/Makefile.am:26: `%'-style pattern rules are a GNU make extension
src/scalefilter/Makefile.am:25: `%'-style pattern rules are a GNU make extension
src/scalefilter/Makefile.am:28: `%'-style pattern rules are a GNU make extension
src/showdesktop/Makefile.am:23: `%'-style pattern rules are a GNU make extension
src/showdesktop/Makefile.am:26: `%'-style pattern rules are a GNU make extension
src/splash/Makefile.am:23: `%'-style pattern rules are a GNU make extension
src/splash/Makefile.am:26: `%'-style pattern rules are a GNU make extension
src/trailfocus/Makefile.am:23: `%'-style pattern rules are a GNU make extension
src/trailfocus/Makefile.am:26: `%'-style pattern rules are a GNU make extension
autoreconf: Leaving directory `.'
./autogen.sh: line 11: intltoolize: command not found

Installing plugins-extra...

Executing make
make: *** Nenhum alvo indicado e nenhum arquivo make encontrado. Pare.

Executing sudo make install
casa is not in the sudoers file. This incident will be reported.

Configuring plugins-unsupported...

Executing autogen.sh --prefix=/usr/local in plugins-unsupported...
autoreconf: Entering directory `.'
autoreconf: configure.ac: not using Gettext
autoreconf: running: aclocal
/usr/share/aclocal/gtk--.m4:10: warning: underquoted definition of AM_PATH_GTKMM
/usr/share/aclocal/gtk--.m4:10: run info '(automake)Extending aclocal'
/usr/share/aclocal/gtk--.m4:10: or see http://sources.redhat.com/automake/automake.html#Extending-aclocal
autoreconf: configure.ac: tracing
autoreconf: running: libtoolize --copy
libtoolize: `config.guess' exists: use `--force' to overwrite
libtoolize: `config.sub' exists: use `--force' to overwrite
libtoolize: `ltmain.sh' exists: use `--force' to overwrite
/usr/share/aclocal/gtk--.m4:10: warning: underquoted definition of AM_PATH_GTKMM
/usr/share/aclocal/gtk--.m4:10: run info '(automake)Extending aclocal'
/usr/share/aclocal/gtk--.m4:10: or see http://sources.redhat.com/automake/automake.html#Extending-aclocal
autoreconf: running: /usr/bin/autoconf
autoreconf: running: /usr/bin/autoheader
autoreconf: running: automake --add-missing --copy --no-force
metadata/Makefile.am:15: patsubst %.xml.in,compiz-%.schemas,$(xml_in_files: non-POSIX variable name
metadata/Makefile.am:15: (probably a GNU make extension)
metadata/Makefile.am:18: `%'-style pattern rules are a GNU make extension
metadata/Makefile.am:19: subst compiz-,,$*: non-POSIX variable name
metadata/Makefile.am:19: (probably a GNU make extension)
src/fakeargb/Makefile.am:23: `%'-style pattern rules are a GNU make extension
src/fakeargb/Makefile.am:26: `%'-style pattern rules are a GNU make extension
src/mswitch/Makefile.am:22: `%'-style pattern rules are a GNU make extension
src/mswitch/Makefile.am:25: `%'-style pattern rules are a GNU make extension
src/snow/Makefile.am:23: `%'-style pattern rules are a GNU make extension
src/snow/Makefile.am:26: `%'-style pattern rules are a GNU make extension
src/tile/Makefile.am:23: `%'-style pattern rules are a GNU make extension
src/tile/Makefile.am:26: `%'-style pattern rules are a GNU make extension
autoreconf: Leaving directory `.'
./autogen.sh: line 11: intltoolize: command not found

Installing plugins-unsupported...

Executing make
make: *** Nenhum alvo indicado e nenhum arquivo make encontrado. Pare.

Executing sudo make install
casa is not in the sudoers file. This incident will be reported.

Installing zoom...

Executing make
warning: failed to load external entity "/schemas.xslt"
cannot parse /schemas.xslt
make: ** [build/compiz-ezoom.schema] Erro 4

Executing make install
make: *** Sem regra para processar o alvo `build/ezoom.lo', necessário por `c-build-objs'. Pare.

Installing wallpaper...

Executing make
/bin/sh: --header=build/wallpaper_options.h: Arquivo ou diretório não encontrado
make: ** [build/wallpaper_options.h] Erro 127

Executing make install
/bin/sh: --header=build/wallpaper_options.h: Arquivo ou diretório não encontrado
make: ** [build/wallpaper_options.h] Erro 127

Installing 3d...

Executing make
/bin/sh: --header=build/3d_options.h: Arquivo ou diretório não encontrado
make: ** [build/3d_options.h] Erro 127

Executing make install
/bin/sh: --header=build/3d_options.h: Arquivo ou diretório não encontrado
make: ** [build/3d_options.h] Erro 127

Installing screensaver...

Executing make
/bin/sh: --header=build/screensaver_options.h: Arquivo ou diretório não encontrado
make: ** [build/screensaver_options.h] Erro 127

Executing make install
/bin/sh: --header=build/screensaver_options.h: Arquivo ou diretório não encontrado
make: ** [build/screensaver_options.h] Erro 127

Installing gears...

Executing make
make: *** Sem regra para processar o alvo `build/gears.lo', necessário por `c-build-objs'. Pare.

Executing make install
make: *** Sem regra para processar o alvo `build/gears.lo', necessário por `c-build-objs'. Pare.

Installing atlantis...

Executing make
/bin/sh: --header=build/atlantis_options.h: Arquivo ou diretório não encontrado
make: ** [build/atlantis_options.h] Erro 127

Executing make install
/bin/sh: --header=build/atlantis_options.h: Arquivo ou diretório não encontrado
make: ** [build/atlantis_options.h] Erro 127

Installing widget...

Executing make
Package compiz was not found in the pkg-config search path.
Perhaps you should add the directory containing `compiz.pc'
to the PKG_CONFIG_PATH environment variable
No package 'compiz' found
widget.c:32:20: error: compiz.h: No such file or directory
widget.c:44: error: expected '=', ',', ';', 'asm' or '__attribute__' before 'widgetMetadata'
widget.c:71: error: expected specifier-qualifier-list before 'CompOption'
widget.c:79: error: expected specifier-qualifier-list before 'CompOption'
widget.c:101: error: expected specifier-qualifier-list before 'Bool'
widget.c:129: error: expected '=', ',', ';', 'asm' or '__attribute__' before '*' token
widget.c:142: error: expected '=', ',', ';', 'asm' or '__attribute__' before 'widgetSetScreenOption'
widget.c:176: error: expected ')' before '*' token
widget.c:250: error: expected '=', ',', ';', 'asm' or '__attribute__' before 'widgetGetWindowStatus'
widget.c:287: error: expected ')' before '*' token
widget.c:315: error: expected ')' before '*' token
widget.c:347: error: expected ')' before '*' token
widget.c:355: error: expected ')' before '*' token
widget.c:365: error: expected ')' before '*' token
widget.c:420: error: expected ')' before '*' token
widget.c:435: error: expected '=', ',', ';', 'asm' or '__attribute__' before 'widgetPaintWindow'
widget.c:486: error: expected ')' before '*' token
widget.c:513: error: expected '=', ',', ';', 'asm' or '__attribute__' before 'widgetToggle'
widget.c:533: error: expected ')' before '*' token
widget.c:680: error: expected '=', ',', ';', 'asm' or '__attribute__' before '*' token
widget.c:693: error: expected '=', ',', ';', 'asm' or '__attribute__' before 'widgetSetDisplayOption'
widget.c:723: error: expected '=', ',', ';', 'asm' or '__attribute__' before 'widgetDisplayOptionInfo'
widget.c:729: error: expected '=', ',', ';', 'asm' or '__attribute__' before 'widgetInitDisplay'
widget.c:766: error: expected ')' before '*' token
widget.c:780: error: expected '=', ',', ';', 'asm' or '__attribute__' before 'widgetScreenOptionInfo'
widget.c:788: error: expected '=', ',', ';', 'asm' or '__attribute__' before 'widgetInitScreen'
widget.c:838: error: expected ')' before '*' token
widget.c:855: error: expected '=', ',', ';', 'asm' or '__attribute__' before 'widgetInitWindow'
widget.c:877: error: expected ')' before '*' token
widget.c:885: error: expected '=', ',', ';', 'asm' or '__attribute__' before 'widgetInit'
widget.c:908: error: expected ')' before '*' token
widget.c:916: error: expected ')' before '*' token
widget.c:922: error: expected '=', ',', ';', 'asm' or '__attribute__' before '*' token
widget.c:928: error: expected '=', ',', ';', 'asm' or '__attribute__' before 'widgetVTable'
widget.c:946: error: expected '=', ',', ';', 'asm' or '__attribute__' before '*' token
make: ** [widget.lo] Erro 1

Executing make install
Package compiz was not found in the pkg-config search path.
Perhaps you should add the directory containing `compiz.pc'
to the PKG_CONFIG_PATH environment variable
No package 'compiz' found
widget.c:32:20: error: compiz.h: No such file or directory
widget.c:44: error: expected '=', ',', ';', 'asm' or '__attribute__' before 'widgetMetadata'
widget.c:71: error: expected specifier-qualifier-list before 'CompOption'
widget.c:79: error: expected specifier-qualifier-list before 'CompOption'
widget.c:101: error: expected specifier-qualifier-list before 'Bool'
widget.c:129: error: expected '=', ',', ';', 'asm' or '__attribute__' before '*' token
widget.c:142: error: expected '=', ',', ';', 'asm' or '__attribute__' before 'widgetSetScreenOption'
widget.c:176: error: expected ')' before '*' token
widget.c:250: error: expected '=', ',', ';', 'asm' or '__attribute__' before 'widgetGetWindowStatus'
widget.c:287: error: expected ')' before '*' token
widget.c:315: error: expected ')' before '*' token
widget.c:347: error: expected ')' before '*' token
widget.c:355: error: expected ')' before '*' token
widget.c:365: error: expected ')' before '*' token
widget.c:420: error: expected ')' before '*' token
widget.c:435: error: expected '=', ',', ';', 'asm' or '__attribute__' before 'widgetPaintWindow'
widget.c:486: error: expected ')' before '*' token
widget.c:513: error: expected '=', ',', ';', 'asm' or '__attribute__' before 'widgetToggle'
widget.c:533: error: expected ')' before '*' token
widget.c:680: error: expected '=', ',', ';', 'asm' or '__attribute__' before '*' token
widget.c:693: error: expected '=', ',', ';', 'asm' or '__attribute__' before 'widgetSetDisplayOption'
widget.c:723: error: expected '=', ',', ';', 'asm' or '__attribute__' before 'widgetDisplayOptionInfo'
widget.c:729: error: expected '=', ',', ';', 'asm' or '__attribute__' before 'widgetInitDisplay'
widget.c:766: error: expected ')' before '*' token
widget.c:780: error: expected '=', ',', ';', 'asm' or '__attribute__' before 'widgetScreenOptionInfo'
widget.c:788: error: expected '=', ',', ';', 'asm' or '__attribute__' before 'widgetInitScreen'
widget.c:838: error: expected ')' before '*' token
widget.c:855: error: expected '=', ',', ';', 'asm' or '__attribute__' before 'widgetInitWindow'
widget.c:877: error: expected ')' before '*' token
widget.c:885: error: expected '=', ',', ';', 'asm' or '__attribute__' before 'widgetInit'
widget.c:908: error: expected ')' before '*' token
widget.c:916: error: expected ')' before '*' token
widget.c:922: error: expected '=', ',', ';', 'asm' or '__attribute__' before '*' token
widget.c:928: error: expected '=', ',', ';', 'asm' or '__attribute__' before 'widgetVTable'
widget.c:946: error: expected '=', ',', ';', 'asm' or '__attribute__' before '*' token
make: ** [widget.lo] Erro 1
casa is not in the sudoers file. This incident will be reported.

Run compiz-manager to load Compiz/Fusion.

Run ccsm (preffered) to configure
Compiz/Fusion

[12] Comentário enviado por Ieso Nagata em 11/08/2007 - 02:33h

note
"casa is not in the sudoers file. This incident will be reported"
ou seja, o usuário "casa" não está incluso em "/etc/sudoers"
como usuário normal tem permissão para o "make", mas não para instalar ("make install")

edite o "/etc/sudoers" adicionando (ou modificando) a linha:
casa ALL=NOPASSWD :ALL

com a linha acima o usuário "casa" ao utilizar o "sudo" não necessitará digitar senha alguma

como citado no guia, este processo é indicado para o lenny (testing) e sid (unstable), você reporta estar efetuando-o no etch (stable), então reporte novamente se obtiver sucesso!

[13] Comentário enviado por lippec em 17/08/2007 - 19:29h

Olá... sou novo usuario de Linux escolhi o Ubuntu ..
1° maravilhado com os graficos .
mas estou com uma pequena dificuldade quanto ao plugin screen saver ele não esta funcionando . gostaria de saber se tem que configurar algum parametro todos meus efeitos estao funcionando normalmente tenho uma placa ATI X1050 pci e.
haaaaaaa e quanto as configurações das janelas pegando fogo no beryl as configs sem problemas mas no compiz fusion nao consegui alguem poderia me ajudar ? [email protected]



[14] Comentário enviado por aline.abreu em 25/11/2007 - 12:33h

Beleza de Tutorial, mas aqui tive uns errinhos.

###################
Executing make install
make: *** Sem regra para processar o alvo `build/3d.lo', necessário por `c-build-objs'. Pare.
sed: não foi possível ler compiz-scripts/manager/compiz-manager: Arquivo ou diretório não encontrado
sed: não foi possível ler compiz-scripts/manager/compiz-manager: Arquivo ou diretório não encontrado
cp: impossível fazer stat em `compiz-scripts/manager/compiz-manager': Arquivo ou diretório não encontrado

Run compiz-manager to load Compiz/Fusion.

Run ccsm (preffered) to configure
Compiz/Fusion
bleno-pc:/home/bleno/compiz-compile# compiz-manager
bash: compiz-manager: command not found
bleno-pc:/home/bleno/compiz-compile# ccsm
Info: No sexy-python package found, don't worry it's optional.
PyGtk 2.10.0 or later required
#################

Seria pela falta deste "sexy-python" ??
Já instalei o PyGtk pelo synaptic e rodei novamente o install e o erro permanece.

consegue me dar alguma luz?

Abraço,
Aline


Contribuir com comentário