Erro no comando "make"-Arch Linux [RESOLVIDO]

1. Erro no comando "make"-Arch Linux [RESOLVIDO]

Everton
evertonstz

(usa Arch Linux)

Enviado em 31/05/2011 - 23:16h

eis a mensagem de erro, algum manjador pode me ajudar a fixa-lá?
gcc -I. -Wall -O2 -c hydra-svn.c -DLIBOPENSSL -DLIBPOSTGRES -DLIBSVN -DLIBSSH -I/usr/local/include -I/usr/include/subversion-1 -I/usr/include/subversion-1
In file included from hydra-svn.c:17:0:
/usr/include/subversion-1/svn_client.h:29:17: fatal error: apr.h: No such file or directory
compilation terminated.
make: *** [hydra-svn.o] Error 1
[root@myhost hydra-5.4-src]# ./
arm/ configure-arm hydra-gtk/ pw-inspector
configure configure-palm palm/
[root@myhost hydra-5.4-src]# ./
arm/ configure-arm hydra-gtk/ pw-inspector
configure configure-palm palm/
[root@myhost hydra-5.4-src]# ./
arm/ configure-arm hydra-gtk/ pw-inspector
configure configure-palm palm/
[root@myhost hydra-5.4-src]# make
gcc -I. -Wall -O2 -c hydra-svn.c -DLIBOPENSSL -DLIBPOSTGRES -DLIBSVN -DLIBSSH -I/usr/local/include -I/usr/include/subversion-1 -I/usr/include/subversion-1
In file included from hydra-svn.c:17:0:
/usr/include/subversion-1/svn_client.h:29:17: fatal error: apr.h: No such file or directory
compilation terminated.
make: *** [hydra-svn.o] Error 1


  






Patrocínio

Site hospedado pelo provedor RedeHost.
Linux banner
Linux banner
Linux banner

Destaques

Artigos

Dicas

Tópicos

Top 10 do mês

Scripts