problemas em lib ao tentar instalar slackbuilds

1. problemas em lib ao tentar instalar slackbuilds

willian firmino
willian.firmino

(usa Slackware)

Enviado em 08/09/2016 - 08:18h

varios programas que estou tentando instalar, estão apresentando este erro:

/usr/lib64/libnvidia-glcore.so.370.23: undefined reference to `__VkWsiDirectUnix::Init()'
collect2: error: ld returned 1 exit status
make[3]: *** [xarchiver] Error 1
Makefile:360: recipe for target 'xarchiver' failed
make[3]: Leaving directory '/tmp/SBo/xarchiver-0.5.4/src'
make[2]: *** [all-recursive] Error 1
Makefile:783: recipe for target 'all-recursive' failed
make[2]: Leaving directory '/tmp/SBo/xarchiver-0.5.4/src'
make[1]: *** [all-recursive] Error 1
Makefile:386: recipe for target 'all-recursive' failed
make[1]: Leaving directory '/tmp/SBo/xarchiver-0.5.4'
make: *** [all] Error 2
Makefile:279: recipe for target 'all' failed
Failure encountered while building xarchiver:
xarchiver.SlackBuild return non-zero

neste caso tentando instalar o xarchiver, minha placa de vídeo é uma gforce gt 730 nvidia-kernel e nvidia-driver copilados pelo slackbuid https://www.slackbuilds.org/repository/14.2/system/nvidia-driver a versão que estou utilizando do driver é a 370.23, alguém sabe o que pode estar acontecendo?


  






Patrocínio

Site hospedado pelo provedor RedeHost.
Linux banner
Linux banner
Linux banner

Artigos

Dicas

Tópicos

Top 10 do mês

Scripts