Erro em compilação [RESOLVIDO]

1. Erro em compilação [RESOLVIDO]

Everton
evertonstz

(usa Arch Linux)

Enviado em 23/04/2011 - 12:12h

Estou tentando compilar um applet para o kde 4 e retorna o seguinte erro:

/home/everton/Downloads/stasks-0.5.1/applet/stasks_applet.cpp:90:30: error: 'AbstractItemPtr' is not a member of 'TaskManager'
make[2]: *** [applet/CMakeFiles/plasma_applet_stasks.dir/stasks_applet.o] Error 1
make[1]: *** [applet/CMakeFiles/plasma_applet_stasks.dir/all] Error 2
make: *** [all] Error 2

Já precisei compilar algumas coisas antes, mas nunca recebia tal erro, algum dinossauro da compilação saberia resolver?


  


2. Re: Erro em compilação [RESOLVIDO]

RNT
rnt2

(usa Slackware)

Enviado em 26/04/2011 - 00:05h

Faça o download desse patch: http://www.wuala.com/ZaWertun/stasks/stasks_allinone.patch

Coloque o arquivo stasks_allinone.patch dentro da pasta applet (no diretório onde vc está rodando o comando make) e aplique o patch com o comando:

patch < stasks_allinone.patch

Depois rode o make novamente, deve funcionar.

PS: O link do Patch foi retirado da página do Stasks no kde-look.org: http://kde-look.org/content/show.php?content=99739&forumpage=30&PHPSESSID=cae






Patrocínio

Site hospedado pelo provedor RedeHost.
Linux banner
Linux banner
Linux banner

Destaques

Artigos

Dicas

Tópicos

Top 10 do mês

Scripts