Atheros AR2413 em UBUNTU 7.10

1. Atheros AR2413 em UBUNTU 7.10

victor
victorpaiao

(usa Fedora)

Enviado em 10/12/2007 - 11:33h


Olá a todos! Já não sei o que fazer com esse meu problema... Eu possuo um acer 3650 com placa de rede sem fio Atheros AR2413. Estou tentando configura-la em um ubuntu 7.10. O engraçado do meu problema é que quando eu instalo e inicio o ubuntu pela primeira vez a placa de rede sem fio é conhecida e ativada automaticamente pelo gerenciador de drivers restritos. Porém quando eu instalo a minha placa de vídeo ati radeon xpress 200m pelo assistente de drivers restritos e reinicio o ubuntu a placa de rede (mesmo estando com o led aceso) simplesmente para de funcionar. Já formatei o notebook 3 vezes ontem achando que era após eu atualizar o sistema. Só na 3º vez que percebi que o problema era com a instalação da placa de vídeo. Por favor peço ajuda a todos. Quero usar somente o linux no meu notebook mas sem placa de rede sem fio não dá. :/

Obrigado desde já..


  


2. Re: Atheros AR2413 em UBUNTU 7.10

Marcelo Cavalcante Rocha
kalib

(usa Arch Linux)

Enviado em 10/12/2007 - 11:59h

No meu ele reconheceu normalmente com a versão 7.10..e minha placa tb é atheros...
Mas tente o seguinte...instale o pacote madwifi...já resolveu meu problema em versões anteriores.. ;]


3. deu o seguinte erro

victor
victorpaiao

(usa Fedora)

Enviado em 10/12/2007 - 12:05h

Checking requirements... ok.
Checking kernel configuration... ok.
make -C /lib/modules/2.6.22-14-generic/build SUBDIRS=/home/victor/Área de Trabalho/madwifi-0.9.3.3 modules
make[1]: Entering directory `/usr/src/linux-headers-2.6.22-14-generic'
make[1]: *** No rule to make target `de'. Stop.
make[1]: Leaving directory `/usr/src/linux-headers-2.6.22-14-generic'
make: ** [modules] Erro 2



4. E depois que eu movi para uma pasta sem espaços deu o seguinte;

victor
victorpaiao

(usa Fedora)

Enviado em 10/12/2007 - 12:08h

Checking requirements... ok.
Checking kernel configuration... ok.
make -C /lib/modules/2.6.22-14-generic/build SUBDIRS=/home/victor/madwifi-0.9.3.3 modules
make[1]: Entering directory `/usr/src/linux-headers-2.6.22-14-generic'
CC [M] /home/victor/madwifi-0.9.3.3/ath/if_ath.o
CC [M] /home/victor/madwifi-0.9.3.3/ath/if_ath_pci.o
LD [M] /home/victor/madwifi-0.9.3.3/ath/ath_pci.o
CC [M] /home/victor/madwifi-0.9.3.3/ath_hal/ah_os.o
HOSTCC /home/victor/madwifi-0.9.3.3/ath_hal/uudecode
/home/victor/madwifi-0.9.3.3/ath_hal/uudecode.c:26:19: error: stdio.h: No such file or directory
/home/victor/madwifi-0.9.3.3/ath_hal/uudecode.c:27:19: error: errno.h: No such file or directory
/home/victor/madwifi-0.9.3.3/ath_hal/uudecode.c:28:20: error: getopt.h: No such file or directory
/home/victor/madwifi-0.9.3.3/ath_hal/uudecode.c:29:20: error: string.h: No such file or directory
/home/victor/madwifi-0.9.3.3/ath_hal/uudecode.c:30:20: error: stdlib.h: No such file or directory
/home/victor/madwifi-0.9.3.3/ath_hal/uudecode.c:32:23: error: sys/fcntl.h: No such file or directory
/home/victor/madwifi-0.9.3.3/ath_hal/uudecode.c:33:22: error: sys/stat.h: No such file or directory
/home/victor/madwifi-0.9.3.3/ath_hal/uudecode.c: In function 'uudecode_usage':
/home/victor/madwifi-0.9.3.3/ath_hal/uudecode.c:37: warning: implicit declaration of function 'printf'
/home/victor/madwifi-0.9.3.3/ath_hal/uudecode.c:37: warning: incompatible implicit declaration of built-in function 'printf'
/home/victor/madwifi-0.9.3.3/ath_hal/uudecode.c: At top level:
/home/victor/madwifi-0.9.3.3/ath_hal/uudecode.c:40: error: expected ')' before '*' token
/home/victor/madwifi-0.9.3.3/ath_hal/uudecode.c:70: error: expected ')' before '*' token
/home/victor/madwifi-0.9.3.3/ath_hal/uudecode.c: In function 'main':
/home/victor/madwifi-0.9.3.3/ath_hal/uudecode.c:121: error: 'FILE' undeclared (first use in this function)
/home/victor/madwifi-0.9.3.3/ath_hal/uudecode.c:121: error: (Each undeclared identifier is reported only once
/home/victor/madwifi-0.9.3.3/ath_hal/uudecode.c:121: error: for each function it appears in.)
/home/victor/madwifi-0.9.3.3/ath_hal/uudecode.c:121: error: 'src_stream' undeclared (first use in this function)
/home/victor/madwifi-0.9.3.3/ath_hal/uudecode.c:122: error: 'dst_stream' undeclared (first use in this function)
/home/victor/madwifi-0.9.3.3/ath_hal/uudecode.c:122: error: 'NULL' undeclared (first use in this function)
/home/victor/madwifi-0.9.3.3/ath_hal/uudecode.c:130: warning: implicit declaration of function 'getopt'
/home/victor/madwifi-0.9.3.3/ath_hal/uudecode.c:134: error: 'optarg' undeclared (first use in this function)
/home/victor/madwifi-0.9.3.3/ath_hal/uudecode.c:138: warning: implicit declaration of function 'exit'
/home/victor/madwifi-0.9.3.3/ath_hal/uudecode.c:138: warning: incompatible implicit declaration of built-in function 'exit'
/home/victor/madwifi-0.9.3.3/ath_hal/uudecode.c:141: error: 'optind' undeclared (first use in this function)
/home/victor/madwifi-0.9.3.3/ath_hal/uudecode.c:142: error: 'stdin' undeclared (first use in this function)
/home/victor/madwifi-0.9.3.3/ath_hal/uudecode.c:144: warning: implicit declaration of function 'fopen'
/home/victor/madwifi-0.9.3.3/ath_hal/uudecode.c:146: warning: implicit declaration of function 'fprintf'
/home/victor/madwifi-0.9.3.3/ath_hal/uudecode.c:146: warning: incompatible implicit declaration of built-in function 'fprintf'
/home/victor/madwifi-0.9.3.3/ath_hal/uudecode.c:146: error: 'stderr' undeclared (first use in this function)
/home/victor/madwifi-0.9.3.3/ath_hal/uudecode.c:147: warning: implicit declaration of function 'strerror'
/home/victor/madwifi-0.9.3.3/ath_hal/uudecode.c:147: error: 'errno' undeclared (first use in this function)
/home/victor/madwifi-0.9.3.3/ath_hal/uudecode.c:147: warning: format '%s' expects type 'char *', but argument 4 has type 'int'
/home/victor/madwifi-0.9.3.3/ath_hal/uudecode.c:148: warning: incompatible implicit declaration of built-in function 'exit'
/home/victor/madwifi-0.9.3.3/ath_hal/uudecode.c:152: warning: incompatible implicit declaration of built-in function 'exit'
/home/victor/madwifi-0.9.3.3/ath_hal/uudecode.c:156: warning: implicit declaration of function 'get_line_from_file'
/home/victor/madwifi-0.9.3.3/ath_hal/uudecode.c:156: warning: assignment makes pointer from integer without a cast
/home/victor/madwifi-0.9.3.3/ath_hal/uudecode.c:157: warning: implicit declaration of function 'strncmp'
/home/victor/madwifi-0.9.3.3/ath_hal/uudecode.c:164: warning: incompatible implicit declaration of built-in function 'fprintf'
/home/victor/madwifi-0.9.3.3/ath_hal/uudecode.c:165: warning: incompatible implicit declaration of built-in function 'exit'
/home/victor/madwifi-0.9.3.3/ath_hal/uudecode.c:168: warning: implicit declaration of function 'strtoul'
/home/victor/madwifi-0.9.3.3/ath_hal/uudecode.c:170: warning: implicit declaration of function 'strchr'
/home/victor/madwifi-0.9.3.3/ath_hal/uudecode.c:170: warning: incompatible implicit declaration of built-in function 'strchr'
/home/victor/madwifi-0.9.3.3/ath_hal/uudecode.c:172: warning: incompatible implicit declaration of built-in function 'fprintf'
/home/victor/madwifi-0.9.3.3/ath_hal/uudecode.c:173: warning: incompatible implicit declaration of built-in function 'exit'
/home/victor/madwifi-0.9.3.3/ath_hal/uudecode.c:178: warning: implicit declaration of function 'strcmp'
/home/victor/madwifi-0.9.3.3/ath_hal/uudecode.c:179: error: 'stdout' undeclared (first use in this function)
/home/victor/madwifi-0.9.3.3/ath_hal/uudecode.c:182: error: 'O_WRONLY' undeclared (first use in this function)
/home/victor/madwifi-0.9.3.3/ath_hal/uudecode.c:182: error: 'O_CREAT' undeclared (first use in this function)
/home/victor/madwifi-0.9.3.3/ath_hal/uudecode.c:182: error: 'O_TRUNC' undeclared (first use in this function)
/home/victor/madwifi-0.9.3.3/ath_hal/uudecode.c:186: error: 'O_EXCL' undeclared (first use in this function)
/home/victor/madwifi-0.9.3.3/ath_hal/uudecode.c:188: warning: implicit declaration of function 'open'
/home/victor/madwifi-0.9.3.3/ath_hal/uudecode.c:189: error: 'S_IRWXU' undeclared (first use in this function)
/home/victor/madwifi-0.9.3.3/ath_hal/uudecode.c:189: error: 'S_IRWXG' undeclared (first use in this function)
/home/victor/madwifi-0.9.3.3/ath_hal/uudecode.c:189: error: 'S_IRWXO' undeclared (first use in this function)
/home/victor/madwifi-0.9.3.3/ath_hal/uudecode.c:191: warning: implicit declaration of function 'fdopen'
/home/victor/madwifi-0.9.3.3/ath_hal/uudecode.c:193: warning: incompatible implicit declaration of built-in function 'fprintf'
/home/victor/madwifi-0.9.3.3/ath_hal/uudecode.c:194: warning: format '%s' expects type 'char *', but argument 4 has type 'int'
/home/victor/madwifi-0.9.3.3/ath_hal/uudecode.c:195: warning: incompatible implicit declaration of built-in function 'exit'
/home/victor/madwifi-0.9.3.3/ath_hal/uudecode.c:199: warning: implicit declaration of function 'read_stduu'
/home/victor/madwifi-0.9.3.3/ath_hal/uudecode.c:201: warning: implicit declaration of function 'fclose'
make[3]: *** [/home/victor/madwifi-0.9.3.3/ath_hal/uudecode] Error 1
make[2]: *** [/home/victor/madwifi-0.9.3.3/ath_hal] Error 2
make[1]: *** [_module_/home/victor/madwifi-0.9.3.3] Error 2
make[1]: Leaving directory `/usr/src/linux-headers-2.6.22-14-generic'
make: ** [modules] Erro 2



5. acer 5610

Rodrigo Normandia
koalahbh

(usa Suse)

Enviado em 13/12/2007 - 11:25h

Cara, meu acer 5610 tb tem essa placa atheros faz o seguinte pega o modelo da sua placa e ve a compatibilidade do Madqifi http://madwifi.org/wiki/Compatibility/Atheros se sua placa for compativel pode instalar pq no meu caso eu estava com um problema semlhante no suse e esse carinha ai resolveu meu problema.
[]'s


6. falta de pacotes

skck
sk2ck

(usa Debian)

Enviado em 22/01/2008 - 11:57h

Cara... tava dando esse mesmo problema aqui no meu Ubuntu 7.10. No meu resolveu instalando os pacotes linux-source-2.6.xx e linux-headers-2.6.xx. Você pode baixar o pacote kernel-package também que traz umas ferramentas essenciais para instalação de pacote. Depois que eu fiz isso, compilou normalmente. Baixe também a biblioteca libc6-dev, que é essencial para o compilador gcc. Você pode usar tanto apt-get install [pacote] no terminal como utilizar o synaptic [modo grafico]. Não se esqueça de virar root nisso tá...