Erro na compilação do kernel no Ubuntu

1. Erro na compilação do kernel no Ubuntu

Beatriz
biaamaral

(usa Ubuntu)

Enviado em 20/08/2017 - 04:24h

Estou tentando compilar o kernel 3.2.91 no ubuntu 16.04 porém assim que executo o comando make modules, ele dá este erro:
scripts/Makefile.build:305: recipe for target 'arch/x86/kvm/svm.o' failed
make[2]: *** [arch/x86/kvm/svm.o] Error 1
scripts/Makefile.build:441: recipe for target 'arch/x86/kvm' failed
make[1]: *** [arch/x86/kvm] Error 2
Makefile:947: recipe for target 'arch/x86' failed
make: *** [arch/x86] Error 2
Já mexi nas configurações relacionadas ao kvm no menuconfig, mas não sei o que pode estar causando este erro e como consertá-lo


  


2. Re: Erro na compilação do kernel no Ubuntu

Perfil removido
removido

(usa Nenhuma)

Enviado em 20/08/2017 - 20:55h

Manda o .config do kernel, por gentileza.

Ash nazg durbatulûk, ash nazg gimbatul, ash nazg thrakatulûk, agh burzum-ishi krimpatul!






Patrocínio

Site hospedado pelo provedor RedeHost.
Linux banner
Linux banner
Linux banner

Destaques

Artigos

Dicas

Tópicos

Top 10 do mês

Scripts